Reaction Details
TargetD(1A) dopamine receptor
LigandBDBM50108597
Substrate/Competitorn/a
Meas. Tech.ChEMBL_58664 (CHEMBL670438)
Ki 14±n/a nM
Citation Campiani, GButini, SGemma, SNacci, VFattorusso, CCatalanotti, BGiorgi, GCagnotto, AGoegan, MMennini, TMinetti, PDi Cesare, MAMastroianni, DScafetta, NGalletti, BStasi, MACastorina, MPacifici, LGhirardi, OTinti, OCarminati, P Pyrrolo[1,3]benzothiazepine-based atypical antipsychotic agents. Synthesis, structure-activity relationship, molecular modeling, and biological studies. J Med Chem45:344-59 (2002) D(1A) dopamine receptor
Name:D(1A) dopamine receptor
Type:Enzyme Catalytic Domain
Mol. Mass.:49429.75
Organism:RAT
Description:P18901
Residue:446
BDBM50108597
NameBDBM50108597
Synonyms:(+/-)7-Bromo-9-(4-ethyl-piperazin-1-yl)-9,10-dihydro-4-thia-10a-aza-benzo[f]azulene | CHEMBL333955
TypeSmall organic molecule
Emp. Form.C18H22BrN3S
Mol. Mass.392.356
SMILESCCN1CCN(CC1)C1Cn2cccc2Sc2ccc(Br)cc12