Reaction Details
TargetD(3) dopamine receptor
LigandBDBM50066910
Substrate/Competitorn/a
Meas. Tech.ChEMBL_62766 (CHEMBL676293)
Ki 4.1±n/a nM
Citation Campiani, GButini, SGemma, SNacci, VFattorusso, CCatalanotti, BGiorgi, GCagnotto, AGoegan, MMennini, TMinetti, PDi Cesare, MAMastroianni, DScafetta, NGalletti, BStasi, MACastorina, MPacifici, LGhirardi, OTinti, OCarminati, P Pyrrolo[1,3]benzothiazepine-based atypical antipsychotic agents. Synthesis, structure-activity relationship, molecular modeling, and biological studies. J Med Chem45:344-59 (2002) D(3) dopamine receptor
Name:D(3) dopamine receptor
Type:Protein
Mol. Mass.:49540.58
Organism:Rattus norvegicus (Rat)
Description:P19020
Residue:446
BDBM50066910
NameBDBM50066910
Synonyms:(+/-)7-Chloro-9-(4-methyl-piperazin-1-yl)-9,10-dihydro-4-thia-10a-aza-benzo[f]azulene (S)-(+)-7-Chloro-9-(4-methyl-piperazin-1-yl)-9,10-dihydro-4-thia-10a-aza-benzo[f]azulene(ST1460) CHEMBL120512
TypeSmall organic molecule
Emp. Form.C17H20ClN3S
Mol. Mass.333.879
SMILESCN1CCN(CC1)C1Cn2cccc2Sc2ccc(Cl)cc12