Reaction Details
TargetD(2) dopamine receptor
LigandBDBM50066910
Substrate/Competitorn/a
Meas. Tech.ChEMBL_62710 (CHEMBL675803)
Ki 3.8±n/a nM
Citation Campiani, GButini, SGemma, SNacci, VFattorusso, CCatalanotti, BGiorgi, GCagnotto, AGoegan, MMennini, TMinetti, PDi Cesare, MAMastroianni, DScafetta, NGalletti, BStasi, MACastorina, MPacifici, LGhirardi, OTinti, OCarminati, P Pyrrolo[1,3]benzothiazepine-based atypical antipsychotic agents. Synthesis, structure-activity relationship, molecular modeling, and biological studies. J Med Chem45:344-59 (2002) D(2) dopamine receptor
Name:D(2) dopamine receptor
Type:G Protein-Coupled Receptor (GPCR)
Mol. Mass.:50931.60
Organism:Rattus norvegicus (rat)
Description:P61169
Residue:444
BDBM50066910
NameBDBM50066910
Synonyms:(+/-)7-Chloro-9-(4-methyl-piperazin-1-yl)-9,10-dihydro-4-thia-10a-aza-benzo[f]azulene (S)-(+)-7-Chloro-9-(4-methyl-piperazin-1-yl)-9,10-dihydro-4-thia-10a-aza-benzo[f]azulene(ST1460) CHEMBL120512
TypeSmall organic molecule
Emp. Form.C17H20ClN3S
Mol. Mass.333.879
SMILESCN1CCN(CC1)C1Cn2cccc2Sc2ccc(Cl)cc12