Reaction Details
Target5-hydroxytryptamine receptor 2A
LigandBDBM50108688
Substrate/Competitorn/a
Meas. Tech.ChEMBL_2622 (CHEMBL621534)
Ki 0.38±n/a nM
Citation Fletcher, SRBurkamp, FBlurton, PCheng, SKClarkson, RO'Connor, DSpinks, DTudge, Mvan Niel, MBPatel, SChapman, KMarwood, RShepheard, SBentley, GCook, GPBristow, LJCastro, JLHutson, PHMacLeod, AM 4-(Phenylsulfonyl)piperidines: novel, selective, and bioavailable 5-HT(2A) receptor antagonists. J Med Chem45:492-503 (2002) 5-hydroxytryptamine receptor 2A
Name:5-hydroxytryptamine receptor 2A
Type:G Protein-Coupled Receptor (GPCR)
Mol. Mass.:52852.05
Organism:Rattus norvegicus (rat)
Description:Rat cortex membranes 5-HT2A receptors.
Residue:471
BDBM50108688
NameBDBM50108688
Synonyms:1-(4-fluorophenyl)-4-[6-methoxyspiro[3,4-dihydro-2H-chromene-2,4'-(hexahydropyridine)]-1-yl]-1-butanone | CHEMBL357807
TypeSmall organic molecule
Emp. Form.C24H28FNO3
Mol. Mass.397.4824
SMILESCOc1ccc2OC3(CCN(CCCC(=O)c4ccc(F)cc4)CC3)CCc2c1