Reaction Details
Target5-hydroxytryptamine receptor 2A
LigandBDBM50108689
Substrate/Competitorn/a
Meas. Tech.ChEMBL_2290 (CHEMBL617075)
Ki 1.4±n/a nM
Citation Fletcher, SRBurkamp, FBlurton, PCheng, SKClarkson, RO'Connor, DSpinks, DTudge, Mvan Niel, MBPatel, SChapman, KMarwood, RShepheard, SBentley, GCook, GPBristow, LJCastro, JLHutson, PHMacLeod, AM 4-(Phenylsulfonyl)piperidines: novel, selective, and bioavailable 5-HT(2A) receptor antagonists. J Med Chem45:492-503 (2002) 5-hydroxytryptamine receptor 2A
Name:5-hydroxytryptamine receptor 2A
Type:undefined
Mol. Mass.:52607.65
Organism:Homo sapiens (Human)
Description:P28223
Residue:471
BDBM50108689
NameBDBM50108689
Synonyms:4-(4-Chloro-benzenesulfonyl)-1-[2-(2,4-difluoro-phenyl)-ethyl]-piperidine CHEMBL149429
TypeSmall organic molecule
Emp. Form.C19H20ClF2NO2S
Mol. Mass.399.882
SMILESFc1ccc(CCN2CCC(CC2)S(=O)(=O)c2ccc(Cl)cc2)c(F)c1