Reaction Details
Target5-hydroxytryptamine receptor 2C
LigandBDBM50108691
Substrate/Competitorn/a
Meas. Tech.ChEMBL_2969 (CHEMBL620617)
Ki 600±n/a nM
Citation Fletcher, SRBurkamp, FBlurton, PCheng, SKClarkson, RO'Connor, DSpinks, DTudge, Mvan Niel, MBPatel, SChapman, KMarwood, RShepheard, SBentley, GCook, GPBristow, LJCastro, JLHutson, PHMacLeod, AM 4-(Phenylsulfonyl)piperidines: novel, selective, and bioavailable 5-HT(2A) receptor antagonists. J Med Chem45:492-503 (2002) 5-hydroxytryptamine receptor 2C
Name:5-hydroxytryptamine receptor 2C
Type:G Protein-Coupled Receptor (GPCR)
Mol. Mass.:51836.79
Organism:Homo sapiens (Human)
Description:P28335
Residue:458
BDBM50108691
NameBDBM50108691
Synonyms:1'-(2,4-difluorophenethyl)-7-fluorospiro[3,4-dihydro-2H-chromene-2,4'-(hexahydropyridine)] | CHEMBL148348
TypeSmall organic molecule
Emp. Form.C21H22F3NO
Mol. Mass.361.4007
SMILESFc1ccc(CCN2CCC3(CC2)CCc2ccc(F)cc2O3)c(F)c1