Reaction Details
Target5-hydroxytryptamine receptor 2A
LigandBDBM50108693
Substrate/Competitorn/a
Meas. Tech.ChEMBL_2622 (CHEMBL621534)
Ki 4±n/a nM
Citation Fletcher, SRBurkamp, FBlurton, PCheng, SKClarkson, RO'Connor, DSpinks, DTudge, Mvan Niel, MBPatel, SChapman, KMarwood, RShepheard, SBentley, GCook, GPBristow, LJCastro, JLHutson, PHMacLeod, AM 4-(Phenylsulfonyl)piperidines: novel, selective, and bioavailable 5-HT(2A) receptor antagonists. J Med Chem45:492-503 (2002) 5-hydroxytryptamine receptor 2A
Name:5-hydroxytryptamine receptor 2A
Type:G Protein-Coupled Receptor (GPCR)
Mol. Mass.:52852.05
Organism:Rattus norvegicus (rat)
Description:Rat cortex membranes 5-HT2A receptors.
Residue:471
BDBM50108693
NameBDBM50108693
Synonyms:1'-(2,4-difluorophenethyl)-5-fluorospiro[3,4-dihydro-2H-chromene-2,4'-(hexahydropyridine)] | CHEMBL147164
TypeSmall organic molecule
Emp. Form.C21H22F3NO
Mol. Mass.361.4007
SMILESFc1ccc(CCN2CCC3(CC2)CCc2c(F)cccc2O3)c(F)c1