Reaction Details
TargetD(2) dopamine receptor
LigandBDBM50108698
Substrate/Competitorn/a
Meas. Tech.ChEMBL_87873 (CHEMBL697295)
Ki 1000±n/a nM
Citation Fletcher, SRBurkamp, FBlurton, PCheng, SKClarkson, RO'Connor, DSpinks, DTudge, Mvan Niel, MBPatel, SChapman, KMarwood, RShepheard, SBentley, GCook, GPBristow, LJCastro, JLHutson, PHMacLeod, AM 4-(Phenylsulfonyl)piperidines: novel, selective, and bioavailable 5-HT(2A) receptor antagonists. J Med Chem45:492-503 (2002) D(2) dopamine receptor
Name:D(2) dopamine receptor
Type:Cell-surface receptors
Mol. Mass.:50647.10
Organism:Homo sapiens (Human)
Description:P14416
Residue:443
BDBM50108698
NameBDBM50108698
Synonyms:1'-(2,4-difluorophenethyl)spiro[1,2,3,4-tetrahydronaphthalene-2,4'-(hexahydropyridine)] CHEMBL150210
TypeSmall organic molecule
Emp. Form.C22H25F2N
Mol. Mass.341.4374
SMILESFc1ccc(CCN2CCC3(CC2)CCc2ccccc2C3)c(F)c1