Reaction Details
TargetD(2) dopamine receptor
LigandBDBM50108694
Substrate/Competitorn/a
Meas. Tech.ChEMBL_87873 (CHEMBL697295)
Ki 680±n/a nM
Citation Fletcher, SRBurkamp, FBlurton, PCheng, SKClarkson, RO'Connor, DSpinks, DTudge, Mvan Niel, MBPatel, SChapman, KMarwood, RShepheard, SBentley, GCook, GPBristow, LJCastro, JLHutson, PHMacLeod, AM 4-(Phenylsulfonyl)piperidines: novel, selective, and bioavailable 5-HT(2A) receptor antagonists. J Med Chem45:492-503 (2002) D(2) dopamine receptor
Name:D(2) dopamine receptor
Type:Cell-surface receptors
Mol. Mass.:50647.10
Organism:Homo sapiens (Human)
Description:P14416
Residue:443
BDBM50108694
NameBDBM50108694
Synonyms:2-[[1-(2-(2,4-Difluorophenyl)ethyl)-4-piperidinyl]sulfonyl]benzonitrile CHEMBL146998
TypeSmall organic molecule
Emp. Form.C20H20F2N2O2S
Mol. Mass.390.447
SMILESFc1ccc(CCN2CCC(CC2)S(=O)(=O)c2ccccc2C#N)c(F)c1