Reaction Details
TargetD(2) dopamine receptor
LigandBDBM50108693
Substrate/Competitorn/a
Meas. Tech.ChEMBL_87873 (CHEMBL697295)
Ki 710±n/a nM
Citation Fletcher, SRBurkamp, FBlurton, PCheng, SKClarkson, RO'Connor, DSpinks, DTudge, Mvan Niel, MBPatel, SChapman, KMarwood, RShepheard, SBentley, GCook, GPBristow, LJCastro, JLHutson, PHMacLeod, AM 4-(Phenylsulfonyl)piperidines: novel, selective, and bioavailable 5-HT(2A) receptor antagonists. J Med Chem45:492-503 (2002) D(2) dopamine receptor
Name:D(2) dopamine receptor
Type:Cell-surface receptors
Mol. Mass.:50647.10
Organism:Homo sapiens (Human)
Description:P14416
Residue:443
BDBM50108693
NameBDBM50108693
Synonyms:1'-(2,4-difluorophenethyl)-5-fluorospiro[3,4-dihydro-2H-chromene-2,4'-(hexahydropyridine)] | CHEMBL147164
TypeSmall organic molecule
Emp. Form.C21H22F3NO
Mol. Mass.361.4007
SMILESFc1ccc(CCN2CCC3(CC2)CCc2c(F)cccc2O3)c(F)c1