Reaction Details
TargetPotassium voltage-gated channel subfamily H member 2
LigandBDBM50036756
Substrate/Competitorn/a
Meas. Tech.ChEMBL_214800 (CHEMBL816205)
Ki 1200±n/a nM
Citation Fletcher, SRBurkamp, FBlurton, PCheng, SKClarkson, RO'Connor, DSpinks, DTudge, Mvan Niel, MBPatel, SChapman, KMarwood, RShepheard, SBentley, GCook, GPBristow, LJCastro, JLHutson, PHMacLeod, AM 4-(Phenylsulfonyl)piperidines: novel, selective, and bioavailable 5-HT(2A) receptor antagonists. J Med Chem45:492-503 (2002) Potassium voltage-gated channel subfamily H member 2
Name:Potassium voltage-gated channel subfamily H member 2
Type:Multi-pass membrane protein
Mol. Mass.:126672.65
Organism:Homo sapiens (Human)
Description:Q12809
Residue:1159
BDBM50036756
NameBDBM50036756
Synonyms:1'-phenethylspiro[1,2,3,4-tetrahydronaphthalene-2,4'-(hexahydropyridine)]-1-ol; hydrochloride CHEMBL542942
TypeSmall organic molecule
Emp. Form.C22H27NO
Mol. Mass.321.4559
SMILESOC1c2ccccc2CCC11CCN(CCc2ccccc2)CC1