Reaction Details
Target5-hydroxytryptamine receptor 2A
LigandBDBM50108705
Substrate/Competitorn/a
Meas. Tech.ChEMBL_2290 (CHEMBL617075)
Ki 2.4±n/a nM
Citation Fletcher, SRBurkamp, FBlurton, PCheng, SKClarkson, RO'Connor, DSpinks, DTudge, Mvan Niel, MBPatel, SChapman, KMarwood, RShepheard, SBentley, GCook, GPBristow, LJCastro, JLHutson, PHMacLeod, AM 4-(Phenylsulfonyl)piperidines: novel, selective, and bioavailable 5-HT(2A) receptor antagonists. J Med Chem45:492-503 (2002) 5-hydroxytryptamine receptor 2A
Name:5-hydroxytryptamine receptor 2A
Type:undefined
Mol. Mass.:52607.65
Organism:Homo sapiens (Human)
Description:P28223
Residue:471
BDBM50108705
NameBDBM50108705
Synonyms:1-(4-Fluorophenyl)-2-[4-(phenylsulfonyl)-1-piperidinyl]-ethanone CHEMBL146620
TypeSmall organic molecule
Emp. Form.C19H20FNO3S
Mol. Mass.361.43
SMILESFc1ccc(cc1)C(=O)CN1CCC(CC1)S(=O)(=O)c1ccccc1