Reaction Details
Target5-hydroxytryptamine receptor 2C
LigandBDBM50108711
Substrate/Competitorn/a
Meas. Tech.ChEMBL_2969 (CHEMBL620617)
Ki 640±n/a nM
Citation Fletcher, SRBurkamp, FBlurton, PCheng, SKClarkson, RO'Connor, DSpinks, DTudge, Mvan Niel, MBPatel, SChapman, KMarwood, RShepheard, SBentley, GCook, GPBristow, LJCastro, JLHutson, PHMacLeod, AM 4-(Phenylsulfonyl)piperidines: novel, selective, and bioavailable 5-HT(2A) receptor antagonists. J Med Chem45:492-503 (2002) 5-hydroxytryptamine receptor 2C
Name:5-hydroxytryptamine receptor 2C
Type:G Protein-Coupled Receptor (GPCR)
Mol. Mass.:51836.79
Organism:Homo sapiens (Human)
Description:P28335
Residue:458
BDBM50108711
NameBDBM50108711
Synonyms:4-[[1-(2-(2,4-Difluorophenyl)ethyl)-4-piperidinyl]sulfonyl]benzonitrile CHEMBL150220
TypeSmall organic molecule
Emp. Form.C20H20F2N2O2S
Mol. Mass.390.447
SMILESFc1ccc(CCN2CCC(CC2)S(=O)(=O)c2ccc(cc2)C#N)c(F)c1