Reaction Details
Target5-hydroxytryptamine receptor 2A
LigandBDBM50108691
Substrate/Competitorn/a
Meas. Tech.ChEMBL_2290 (CHEMBL617075)
Ki 3.1±n/a nM
Citation Fletcher, SRBurkamp, FBlurton, PCheng, SKClarkson, RO'Connor, DSpinks, DTudge, Mvan Niel, MBPatel, SChapman, KMarwood, RShepheard, SBentley, GCook, GPBristow, LJCastro, JLHutson, PHMacLeod, AM 4-(Phenylsulfonyl)piperidines: novel, selective, and bioavailable 5-HT(2A) receptor antagonists. J Med Chem45:492-503 (2002) 5-hydroxytryptamine receptor 2A
Name:5-hydroxytryptamine receptor 2A
Type:undefined
Mol. Mass.:52607.65
Organism:Homo sapiens (Human)
Description:P28223
Residue:471
BDBM50108691
NameBDBM50108691
Synonyms:1'-(2,4-difluorophenethyl)-7-fluorospiro[3,4-dihydro-2H-chromene-2,4'-(hexahydropyridine)] | CHEMBL148348
TypeSmall organic molecule
Emp. Form.C21H22F3NO
Mol. Mass.361.4007
SMILESFc1ccc(CCN2CCC3(CC2)CCc2ccc(F)cc2O3)c(F)c1