Reaction Details
Target5-hydroxytryptamine receptor 2A
LigandBDBM50108701
Substrate/Competitorn/a
Meas. Tech.ChEMBL_2622 (CHEMBL621534)
Ki 0.61±n/a nM
Citation Fletcher, SRBurkamp, FBlurton, PCheng, SKClarkson, RO'Connor, DSpinks, DTudge, Mvan Niel, MBPatel, SChapman, KMarwood, RShepheard, SBentley, GCook, GPBristow, LJCastro, JLHutson, PHMacLeod, AM 4-(Phenylsulfonyl)piperidines: novel, selective, and bioavailable 5-HT(2A) receptor antagonists. J Med Chem45:492-503 (2002) 5-hydroxytryptamine receptor 2A
Name:5-hydroxytryptamine receptor 2A
Type:G Protein-Coupled Receptor (GPCR)
Mol. Mass.:52852.05
Organism:Rattus norvegicus (rat)
Description:Rat cortex membranes 5-HT2A receptors.
Residue:471
BDBM50108701
NameBDBM50108701
Synonyms:1'-[2-(2,4-Difluorophenyl)ethyl]-3,4-dihydrospiro[2H-1-benzothiopyran-2,4'-piperidine]-1,1-dioxide CHEMBL146595
TypeSmall organic molecule
Emp. Form.C21H23F2NO2S
Mol. Mass.391.475
SMILESFc1ccc(CCN2CCC3(CC2)CCc2ccccc2S3(=O)=O)c(F)c1