Reaction Details
Target5-hydroxytryptamine receptor 2A
LigandBDBM50036760
Substrate/Competitorn/a
Meas. Tech.ChEMBL_2290 (CHEMBL617075)
Ki 16±n/a nM
Citation Fletcher, SRBurkamp, FBlurton, PCheng, SKClarkson, RO'Connor, DSpinks, DTudge, Mvan Niel, MBPatel, SChapman, KMarwood, RShepheard, SBentley, GCook, GPBristow, LJCastro, JLHutson, PHMacLeod, AM 4-(Phenylsulfonyl)piperidines: novel, selective, and bioavailable 5-HT(2A) receptor antagonists. J Med Chem45:492-503 (2002) 5-hydroxytryptamine receptor 2A
Name:5-hydroxytryptamine receptor 2A
Type:undefined
Mol. Mass.:52607.65
Organism:Homo sapiens (Human)
Description:P28223
Residue:471
BDBM50036760
NameBDBM50036760
Synonyms:6-chloro-1'-phenethylspiro[1,2,3,4-tetrahydronaphthalene-2,4'-(hexahydropyridine)]-1-one | CHEMBL122761
TypeSmall organic molecule
Emp. Form.C22H24ClNO
Mol. Mass.353.885
SMILESClc1ccc2C(=O)C3(CCN(CCc4ccccc4)CC3)CCc2c1