Reaction Details
Target5-hydroxytryptamine receptor 2A
LigandBDBM50108700
Substrate/Competitorn/a
Meas. Tech.ChEMBL_2622 (CHEMBL621534)
Ki 0.690±n/a nM
Citation Fletcher, SRBurkamp, FBlurton, PCheng, SKClarkson, RO'Connor, DSpinks, DTudge, Mvan Niel, MBPatel, SChapman, KMarwood, RShepheard, SBentley, GCook, GPBristow, LJCastro, JLHutson, PHMacLeod, AM 4-(Phenylsulfonyl)piperidines: novel, selective, and bioavailable 5-HT(2A) receptor antagonists. J Med Chem45:492-503 (2002) 5-hydroxytryptamine receptor 2A
Name:5-hydroxytryptamine receptor 2A
Type:G Protein-Coupled Receptor (GPCR)
Mol. Mass.:52852.05
Organism:Rattus norvegicus (rat)
Description:Rat cortex membranes 5-HT2A receptors.
Residue:471
BDBM50108700
NameBDBM50108700
Synonyms:1'-(2,4-difluorophenethyl)-6-methoxyspiro[3,4-dihydro-2H-chromene-2,4'-(hexahydropyridine)] CHEMBL146233
TypeSmall organic molecule
Emp. Form.C22H25F2NO2
Mol. Mass.373.4362
SMILESCOc1ccc2OC3(CCN(CCc4ccc(F)cc4F)CC3)CCc2c1