Reaction Details
Target5-hydroxytryptamine receptor 2A
LigandBDBM50108710
Substrate/Competitorn/a
Meas. Tech.ChEMBL_2290 (CHEMBL617075)
Ki 15±n/a nM
Citation Fletcher, SRBurkamp, FBlurton, PCheng, SKClarkson, RO'Connor, DSpinks, DTudge, Mvan Niel, MBPatel, SChapman, KMarwood, RShepheard, SBentley, GCook, GPBristow, LJCastro, JLHutson, PHMacLeod, AM 4-(Phenylsulfonyl)piperidines: novel, selective, and bioavailable 5-HT(2A) receptor antagonists. J Med Chem45:492-503 (2002) 5-hydroxytryptamine receptor 2A
Name:5-hydroxytryptamine receptor 2A
Type:undefined
Mol. Mass.:52607.65
Organism:Homo sapiens (Human)
Description:P28223
Residue:471
BDBM50108710
NameBDBM50108710
Synonyms:4-(4-Benzenesulfonyl-piperidin-1-yl)-1-(4-fluoro-phenyl)-butan-1-one | CHEMBL343411
TypeSmall organic molecule
Emp. Form.C21H24FNO3S
Mol. Mass.389.484
SMILESFc1ccc(cc1)C(=O)CCCN1CCC(CC1)S(=O)(=O)c1ccccc1