Reaction Details
TargetMitogen-activated protein kinase 1
LigandBDBM50108771
Substrate/Competitorn/a
Meas. Tech.ChEMBL_124014 (CHEMBL729502)
IC50 2800±n/a nM
Citation Tasdemir, DMallon, RGreenstein, MFeldberg, LRKim, SCCollins, KWojciechowicz, DMangalindan, GCConcepción, GPHarper, MKIreland, CM Aldisine alkaloids from the Philippine sponge Stylissa massa are potent inhibitors of mitogen-activated protein kinase kinase-1 (MEK-1). J Med Chem45:529-32 (2002) Mitogen-activated protein kinase 1
Name:Mitogen-activated protein kinase 1
Type:Ser/Thr Protein Kinase
Mol. Mass.:41392.76
Organism:Homo sapiens (Human)
Description:P28482
Residue:360
BDBM50108771
NameBDBM50108771
Synonyms:2'-amino-3'-methoxyflavone 2-(2-Amino-3-methoxy-phenyl)-chromen-4-one(PD98059) CHEMBL35482 | PD-98059
TypeSmall organic molecule
Emp. Form.C16H13NO3
Mol. Mass.267.2793
SMILESCOc1cccc(c1N)-c1cc(=O)c2ccccc2o1