Reaction Details
TargetDual specificity mitogen-activated protein kinase kinase 1
LigandBDBM50108774
Substrate/Competitorn/a
Meas. Tech.ChEMBL_123850 (CHEMBL731425)
IC50 2500±n/a nM
Citation Tasdemir, DMallon, RGreenstein, MFeldberg, LRKim, SCCollins, KWojciechowicz, DMangalindan, GCConcepción, GPHarper, MKIreland, CM Aldisine alkaloids from the Philippine sponge Stylissa massa are potent inhibitors of mitogen-activated protein kinase kinase-1 (MEK-1). J Med Chem45:529-32 (2002) Dual specificity mitogen-activated protein kinase kinase 1
Name:Dual specificity mitogen-activated protein kinase kinase 1
Type:Other Protein Type
Mol. Mass.:43439.03
Organism:Homo sapiens (Human)
Description:Full-length human MEK-1 was generated by PCR and purified as a fusion protein from Escherichia coli lysates.
Residue:393
BDBM50108774
NameBDBM50108774
Synonyms:2-Bromo-6,7-dihydro-1H,5H-pyrrolo[2,3-c]azepine-4,8-dione CHEMBL440356
TypeSmall organic molecule
Emp. Form.C8H7BrN2O2
Mol. Mass.243.057
SMILESBrc1cc2c([nH]1)C(=O)NCCC2=O