Reaction Details
TargetDual specificity mitogen-activated protein kinase kinase 1
LigandBDBM50108773
Substrate/Competitorn/a
Meas. Tech.ChEMBL_123850 (CHEMBL731425)
IC50 2500±n/a nM
Citation Tasdemir, DMallon, RGreenstein, MFeldberg, LRKim, SCCollins, KWojciechowicz, DMangalindan, GCConcepción, GPHarper, MKIreland, CM Aldisine alkaloids from the Philippine sponge Stylissa massa are potent inhibitors of mitogen-activated protein kinase kinase-1 (MEK-1). J Med Chem45:529-32 (2002) Dual specificity mitogen-activated protein kinase kinase 1
Name:Dual specificity mitogen-activated protein kinase kinase 1
Type:Other Protein Type
Mol. Mass.:43439.03
Organism:Homo sapiens (Human)
Description:Full-length human MEK-1 was generated by PCR and purified as a fusion protein from Escherichia coli lysates.
Residue:393
BDBM50108773
NameBDBM50108773
Synonyms:4,5-Dibromo-1H-pyrrole-2-carboxylic acid amide 4,5-dibromopyrrole-2-carboxamide | CHEMBL356164
TypeSmall organic molecule
Emp. Form.C5H4Br2N2O
Mol. Mass.267.906
SMILESNC(=O)c1cc(Br)c(Br)[nH]1