Reaction Details
TargetMitogen-activated protein kinase 1
LigandBDBM59117
Substrate/Competitorn/a
Meas. Tech.ChEMBL_124014 (CHEMBL729502)
IC50 1288±n/a nM
Citation Tasdemir, DMallon, RGreenstein, MFeldberg, LRKim, SCCollins, KWojciechowicz, DMangalindan, GCConcepción, GPHarper, MKIreland, CM Aldisine alkaloids from the Philippine sponge Stylissa massa are potent inhibitors of mitogen-activated protein kinase kinase-1 (MEK-1). J Med Chem45:529-32 (2002) Mitogen-activated protein kinase 1
Name:Mitogen-activated protein kinase 1
Type:Ser/Thr Protein Kinase
Mol. Mass.:41392.76
Organism:Homo sapiens (Human)
Description:P28482
Residue:360
BDBM59117
NameBDBM59117
Synonyms:CHEMBL151430 | Hymenialdisine, 11b
TypeSmall organic molecule
Emp. Form.C11H11Br2N5O
Mol. Mass.389.046
SMILESNc1ncc([nH]1)C1CCNC(=O)c2[nH]c(Br)c(Br)c12