Reaction Details
TargetMitogen-activated protein kinase 1
LigandBDBM50108777
Substrate/Competitorn/a
Meas. Tech.ChEMBL_124014 (CHEMBL729502)
IC50>2500±n/a nM
Citation Tasdemir, DMallon, RGreenstein, MFeldberg, LRKim, SCCollins, KWojciechowicz, DMangalindan, GCConcepción, GPHarper, MKIreland, CM Aldisine alkaloids from the Philippine sponge Stylissa massa are potent inhibitors of mitogen-activated protein kinase kinase-1 (MEK-1). J Med Chem45:529-32 (2002) Mitogen-activated protein kinase 1
Name:Mitogen-activated protein kinase 1
Type:Ser/Thr Protein Kinase
Mol. Mass.:41392.76
Organism:Homo sapiens (Human)
Description:P28482
Residue:360
BDBM50108777
NameBDBM50108777
Synonyms:6,7-Dihydro-1H,5H-pyrrolo[2,3-c]azepine-4,8-dione aldisin
TypeSmall organic molecule
Emp. Form.C8H8N2O2
Mol. Mass.164.1613
SMILESO=C1CCNC(=O)c2[nH]ccc12