Reaction Details
TargetDual specificity mitogen-activated protein kinase kinase 1
LigandBDBM50363645
Substrate/Competitorn/a
Meas. Tech.ChEMBL_123850 (CHEMBL731425)
IC50 2500±n/a nM
Citation Tasdemir, DMallon, RGreenstein, MFeldberg, LRKim, SCCollins, KWojciechowicz, DMangalindan, GCConcepción, GPHarper, MKIreland, CM Aldisine alkaloids from the Philippine sponge Stylissa massa are potent inhibitors of mitogen-activated protein kinase kinase-1 (MEK-1). J Med Chem45:529-32 (2002) Dual specificity mitogen-activated protein kinase kinase 1
Name:Dual specificity mitogen-activated protein kinase kinase 1
Type:Other Protein Type
Mol. Mass.:43439.03
Organism:Homo sapiens (Human)
Description:Full-length human MEK-1 was generated by PCR and purified as a fusion protein from Escherichia coli lysates.
Residue:393
BDBM50363645
NameBDBM50363645
Synonyms:DEBROMOHYMENIALDISINE
TypeSmall organic molecule
Emp. Form.C11H11N5O2
Mol. Mass.245.2373
SMILESNC1=NC(C(=O)N1)=C1CCNC(=O)c2[nH]ccc12