Reaction Details
TargetDelta-type opioid receptor
LigandBDBM50108789
Substrate/Competitorn/a
Meas. Tech.ChEMBL_145488 (CHEMBL752131)
Ki 24±n/a nM
Citation Srivastava, SKHusbands, SMAceto, MDMiller, CNTraynor, JRLewis, JW 4'-Arylpyrrolomorphinans: effect of a pyrrolo-N-benzyl substituent in enhancing delta-opioid antagonist activity. J Med Chem45:537-40 (2002) Delta-type opioid receptor
Name:Delta-type opioid receptor
Type:G Protein-Coupled Receptor (GPCR)
Mol. Mass.:40382.98
Organism:Homo sapiens (Human)
Description:Competition binding assays were carried out using membrane preparations from transfected HN9.10 cells that constitutively expressed the delta opioid receptor.
Residue:372
BDBM50108789
NameBDBM50108789
Synonyms:7-benzyl-18-cyclopropylmethyl-5-(4-methylphenyl)-10-oxa-7,18-diazahexacyclo[9.9.1.01,9.02,17.04,8.015,21]henicosa-4(8),5,11,13,15(21)-pentaene-2,12-diol | CHEMBL356473
TypeSmall organic molecule
Emp. Form.C36H36N2O3
Mol. Mass.544.6826
SMILESCc1ccc(cc1)-c1cn(Cc2ccccc2)c2[C@@H]3Oc4c5c(CC6N(CC7CC7)CC[C@@]35[C@@]6(O)Cc12)ccc4O