Reaction Details
TargetDelta-type opioid receptor
LigandBDBM50108790
Substrate/Competitorn/a
Meas. Tech.ChEMBL_145314 (CHEMBL751920)
EC50 41±n/a nM
Citation Srivastava, SKHusbands, SMAceto, MDMiller, CNTraynor, JRLewis, JW 4'-Arylpyrrolomorphinans: effect of a pyrrolo-N-benzyl substituent in enhancing delta-opioid antagonist activity. J Med Chem45:537-40 (2002) Delta-type opioid receptor
Name:Delta-type opioid receptor
Type:G Protein-Coupled Receptor (GPCR)
Mol. Mass.:40382.98
Organism:Homo sapiens (Human)
Description:Competition binding assays were carried out using membrane preparations from transfected HN9.10 cells that constitutively expressed the delta opioid receptor.
Residue:372
BDBM50108790
NameBDBM50108790
Synonyms:7-benzyl-18-methyl-5-phenyl-10-oxa-7,18-diazahexacyclo[9.9.1.01,9.02,17.04,8.015,21]henicosa-4(8),5,11,13,15(21)-pentaene-2,12-diol | CHEMBL151476
TypeSmall organic molecule
Emp. Form.C32H30N2O3
Mol. Mass.490.5922
SMILESCN1CC[C@@]23[C@H]4Oc5c2c(CC1[C@]3(O)Cc1c(cn(Cc2ccccc2)c41)-c1ccccc1)ccc5O