Reaction Details
TargetDelta-type opioid receptor
LigandBDBM50108788
Substrate/Competitorn/a
Meas. Tech.ChEMBL_145489 (CHEMBL752132)
Ki 14±n/a nM
Citation Srivastava, SKHusbands, SMAceto, MDMiller, CNTraynor, JRLewis, JW 4'-Arylpyrrolomorphinans: effect of a pyrrolo-N-benzyl substituent in enhancing delta-opioid antagonist activity. J Med Chem45:537-40 (2002) Delta-type opioid receptor
Name:Delta-type opioid receptor
Type:G Protein-Coupled Receptor (GPCR)
Mol. Mass.:40382.98
Organism:Homo sapiens (Human)
Description:Competition binding assays were carried out using membrane preparations from transfected HN9.10 cells that constitutively expressed the delta opioid receptor.
Residue:372
BDBM50108788
NameBDBM50108788
Synonyms:7-benzyl-18-cyclopropylmethyl-5-phenyl-10-oxa-7,18-diazahexacyclo[9.9.1.01,9.02,17.04,8.015,21]henicosa-4(8),5,11,13,15(21)-pentaene-2,12-diol | CHEMBL346879
TypeSmall organic molecule
Emp. Form.C35H34N2O3
Mol. Mass.530.6561
SMILESOc1ccc2CC3N(CC4CC4)CC[C@@]45[C@@H](Oc1c24)c1c(C[C@@]35O)c(cn1Cc1ccccc1)-c1ccccc1