Reaction Details
TargetMu-type opioid receptor
LigandBDBM50108789
Substrate/Competitorn/a
Meas. Tech.ChEMBL_145594 (CHEMBL884514)
EC50 1360±n/a nM
Citation Srivastava, SKHusbands, SMAceto, MDMiller, CNTraynor, JRLewis, JW 4'-Arylpyrrolomorphinans: effect of a pyrrolo-N-benzyl substituent in enhancing delta-opioid antagonist activity. J Med Chem45:537-40 (2002) Mu-type opioid receptor
Name:Mu-type opioid receptor
Type:G Protein-Coupled Receptor (GPCR)
Mol. Mass.:44789.51
Organism:Homo sapiens (Human)
Description:P35372
Residue:400
BDBM50108789
NameBDBM50108789
Synonyms:7-benzyl-18-cyclopropylmethyl-5-(4-methylphenyl)-10-oxa-7,18-diazahexacyclo[9.9.1.01,9.02,17.04,8.015,21]henicosa-4(8),5,11,13,15(21)-pentaene-2,12-diol | CHEMBL356473
TypeSmall organic molecule
Emp. Form.C36H36N2O3
Mol. Mass.544.6826
SMILESCc1ccc(cc1)-c1cn(Cc2ccccc2)c2[C@@H]3Oc4c5c(CC6N(CC7CC7)CC[C@@]35[C@@]6(O)Cc12)ccc4O