Reaction Details
TargetKappa-type opioid receptor
LigandBDBM50108792
Substrate/Competitorn/a
Meas. Tech.ChEMBL_145257 (CHEMBL751035)
Ki 191±n/a nM
Citation Srivastava, SKHusbands, SMAceto, MDMiller, CNTraynor, JRLewis, JW 4'-Arylpyrrolomorphinans: effect of a pyrrolo-N-benzyl substituent in enhancing delta-opioid antagonist activity. J Med Chem45:537-40 (2002) Kappa-type opioid receptor
Name:Kappa-type opioid receptor
Type:G Protein-Coupled Receptor (GPCR)
Mol. Mass.:42648.76
Organism:Homo sapiens (Human)
Description:P41145
Residue:380
BDBM50108792
NameBDBM50108792
Synonyms:7-benzyl-5-phenyl-18-propyl-10-oxa-7,18-diazahexacyclo[9.9.1.01,9.02,17.04,8.015,21]henicosa-4(8),5,11,13,15(21)-pentaene-2,12-diol | CHEMBL440179
TypeSmall organic molecule
Emp. Form.C34H34N2O3
Mol. Mass.518.6454
SMILESCCCN1CC[C@@]23[C@H]4Oc5c2c(CC1[C@]3(O)Cc1c(cn(Cc2ccccc2)c41)-c1ccccc1)ccc5O