Reaction Details
TargetMu-type opioid receptor
LigandBDBM50108793
Substrate/Competitorn/a
Meas. Tech.ChEMBL_145589 (CHEMBL749734)
Ki>10000±n/a nM
Citation Srivastava, SKHusbands, SMAceto, MDMiller, CNTraynor, JRLewis, JW 4'-Arylpyrrolomorphinans: effect of a pyrrolo-N-benzyl substituent in enhancing delta-opioid antagonist activity. J Med Chem45:537-40 (2002) Mu-type opioid receptor
Name:Mu-type opioid receptor
Type:G Protein-Coupled Receptor (GPCR)
Mol. Mass.:44789.51
Organism:Homo sapiens (Human)
Description:P35372
Residue:400
BDBM50108793
NameBDBM50108793
Synonyms:7-benzyl-12-methoxy-18-methyl-5-phenyl-10-oxa-7,18-diazahexacyclo[9.9.1.01,9.02,17.04,8.015,21]henicosa-4(8),5,11,13,15(21)-pentaen-2-ol | CHEMBL356186
TypeSmall organic molecule
Emp. Form.C33H32N2O3
Mol. Mass.504.6188
SMILESCOc1ccc2CC3N(C)CC[C@@]45[C@@H](Oc1c24)c1c(C[C@@]35O)c(cn1Cc1ccccc1)-c1ccccc1