Reaction Details
TargetKappa-type opioid receptor
LigandBDBM50108787
Substrate/Competitorn/a
Meas. Tech.ChEMBL_145257 (CHEMBL751035)
Ki 183±n/a nM
Citation Srivastava, SKHusbands, SMAceto, MDMiller, CNTraynor, JRLewis, JW 4'-Arylpyrrolomorphinans: effect of a pyrrolo-N-benzyl substituent in enhancing delta-opioid antagonist activity. J Med Chem45:537-40 (2002) Kappa-type opioid receptor
Name:Kappa-type opioid receptor
Type:G Protein-Coupled Receptor (GPCR)
Mol. Mass.:42648.76
Organism:Homo sapiens (Human)
Description:P41145
Residue:380
BDBM50108787
NameBDBM50108787
Synonyms:7-benzyl-18-cyclopropylmethyl-6-methyl-5-phenyl-10-oxa-7,18-diazahexacyclo[9.9.1.01,9.02,17.04,8.015,21]henicosa-4(8),5,11,13,15(21)-pentaene-2,12-diol | CHEMBL348268
TypeSmall organic molecule
Emp. Form.C36H36N2O3
Mol. Mass.544.6826
SMILESCc1c(c2C[C@@]3(O)C4Cc5ccc(O)c6O[C@@H](c2n1Cc1ccccc1)[C@]3(CCN4CC1CC1)c56)-c1ccccc1