Reaction Details
TargetGlutamate receptor 1
LigandBDBM86751
Substrate/Competitorn/a
Meas. Tech.ChEMBL_90140 (CHEMBL701239)
Ki 9200±n/a nM
Citation Filla, SAWinter, MAJohnson, KWBleakman, DBell, MGBleisch, TJCastaño, AMClemens-Smith, Adel Prado, MDieckman, DKDominguez, EEscribano, AHo, KHHudziak, KJKatofiasc, MAMartinez-Perez, JAMateo, AMathes, BMMattiuz, ELOgden, AMPhebus, LAStack, DRStratford, REOrnstein, PL Ethyl (3S,4aR,6S,8aR)-6-(4-ethoxycar- bonylimidazol-1-ylmethyl)decahydroiso-quinoline-3-carboxylic ester: a prodrug of a GluR5 kainate receptor antagonist active in two animal models of acute migraine. J Med Chem45:4383-6 (2002) Glutamate receptor 1
Name:Glutamate receptor 1
Type:Enzyme Catalytic Domain
Mol. Mass.:101512.92
Organism:Homo sapiens (Human)
Description:Glutamate AMPA 1 GRIA1 HUMAN::P42261
Residue:906
BDBM86751
NameBDBM86751
Synonyms:CHEMBL14935 LY-293558
TypeSmall organic molecule
Emp. Form.C13H21N5O2
Mol. Mass.279.3381
SMILESOC(=O)[C@@H]1C[C@H]2C[C@@H](CCc3nnn[nH]3)CC[C@H]2CN1