Reaction Details
TargetProthrombin
LigandBDBM50118719
Substrate/Competitorn/a
Meas. Tech.ChEMBL_208329 (CHEMBL813561)
Ki 0.14±n/a nM
Citation Adang, AEde Man, APVogel, GMGrootenhuis, PDSmit, MJPeters, CAVisser, ARewinkel, JBvan Dinther, TLucas, HKelder, Jvan Aelst, SMeuleman, DGvan Boeckel, CA Unique overlap in the prerequisites for thrombin inhibition and oral bioavailability resulting in potent oral antithrombotics. J Med Chem45:4419-32 (2002) Prothrombin
Name:Prothrombin
Type:Protein
Mol. Mass.:70029.57
Organism:Homo sapiens (Human)
Description:P00734
Residue:622
BDBM50118719
NameBDBM50118719
Synonyms:7-Amino-3-{[1-(2-amino-3-cyclohexyl-propionyl)-pyrrolidine-2-carbonyl]-amino}-2-oxo-heptanoic acid | CHEMBL140078
TypeSmall organic molecule
Emp. Form.C21H36N4O5
Mol. Mass.424.5343
SMILESNCCCC[C@H](NC(=O)[C@@H]1CCCN1C(=O)[C@H](N)CC1CCCCC1)C(=O)C(O)=O