Reaction Details
TargetPlatelet-derived growth factor receptor alpha/beta
LigandBDBM50115301
Substrate/Competitorn/a
Meas. Tech.ChEMBL_158521 (CHEMBL768948)
IC50 80±n/a nM
Citation Matsuno, KNakajima, TIchimura, MGiese, NAYu, JCLokker, NAUshiki, JIde, SOda, SNomoto, Y Potent and selective inhibitors of PDGF receptor phosphorylation. 2. Synthesis, structure activity relationship, improvement of aqueous solubility, and biological effects of 4-[4-(N-substituted (thio)carbamoyl)-1-piperazinyl]-6,7-dimethoxyquinazoline derivatives. J Med Chem45:4513-23 (2002) Platelet-derived growth factor receptor alpha/beta
Name:Platelet-derived growth factor receptor alpha/beta
Type:n/a
Mol. Mass.:n/a
Description:ASSAY_ID of EBI is 29498
Components:This complex has 2 components.
Component 1
Name:Platelet-derived growth factor receptor beta
Synonyms:Beta-type platelet-derived growth factor receptor CD140b antigen PDGF Receptor Substrate PDGFR PDGFR-1 PDGFRB PGFRB_HUMAN Platelet-derived growth factor receptor 1 Platelet-derived growth factor receptor beta (PDGFR-beta) Platelet-derived growth factor receptor beta (PDGFRbeta) | VHL/PDGFRB
Type:Enzyme
Mol. Mass.:123922.25
Organism:Homo sapiens (Human)
Description:P09619
Residue:1106
Component 2
Name:Platelet-derived growth factor receptor alpha
Synonyms:Alpha-type platelet-derived growth factor receptor PDGFRA PGFRA_HUMAN Platelet-derived growth factor receptor alpha (PDGFRA) RHEPDGFRA
Type:Protein
Mol. Mass.:122633.38
Organism:Homo sapiens (Human)
Description:P16234
Residue:1089
BDBM50115301
NameBDBM50115301
Synonyms:4-(6,7-Dimethoxy-quinazolin-4-yl)-piperazine-1-carboxylic acid (4-phenoxy-phenyl)-amide | CHEMBL102346
TypeSmall organic molecule
Emp. Form.C27H27N5O4
Mol. Mass.485.5344
SMILESCOc1cc2ncnc(N3CCN(CC3)C(=O)Nc3ccc(Oc4ccccc4)cc3)c2cc1OC