Reaction Details
TargetfMet-Leu-Phe receptor
LigandBDBM50026912
Substrate/Competitorn/a
Meas. Tech.ChEMBL_69352 (CHEMBL677588)
IC50 9200±n/a nM
Citation Loor, FTiberghien, FWenandy, TDidier, ATraber, R Cyclosporins: structure-activity relationships for the inhibition of the human FPR1 formylpeptide receptor. J Med Chem45:4613-28 (2002) fMet-Leu-Phe receptor
Name:fMet-Leu-Phe receptor
Type:Enzyme Catalytic Domain
Mol. Mass.:38456.14
Organism:Homo sapiens (Human)
Description:gi_4503779
Residue:350
BDBM50026912
NameBDBM50026912
Synonyms:CHEMBL2372485
TypeSmall organic molecule
Emp. Form.C61H109N11O12
Mol. Mass.1188.5847
SMILES[H][C@@]1([C@H](O)[C@H](C)C\C=C\C)N(C)C(=O)[C@H](C(C)C)N(C)C(=O)[C@H](CC(C)C)NC(=O)[C@H](CC(C)C)N(C)C(=O)[C@@H](C)NC(=O)[C@H](C)NC(=O)[C@@H](CC(C)C)N(C)C(=O)[C@H](NC(=O)[C@@H](CC(C)C)N(C)C(=O)CN(C)C(=O)[C@H](CC)NC1=O)C(C)C