Reaction Details
TargetAdenosine receptor A1
LigandBDBM50207816
Substrate/Competitorn/a
Meas. Tech.ChEMBL_29113 (CHEMBL638725)
Ki 1.3±n/a nM
Citation Bondavalli, FBotta, MBruno, OCiacci, ACorelli, FFossa, PLucacchini, AManetti, FMartini, CMenozzi, GMosti, LRanise, ASchenone, STafi, ATrincavellic, ML Synthesis, molecular modeling studies, and pharmacological activity of selective A(1) receptor antagonists. J Med Chem45:4875-87 (2002) Adenosine receptor A1
Name:Adenosine receptor A1
Type:Enzyme Catalytic Domain
Mol. Mass.:36602.99
Organism:BOVINE
Description:ADENOSINE 0 BOVINE::P28190
Residue:326
BDBM50207816
NameBDBM50207816
Synonyms:CHEMBL273094 N-(2-Amino-ethyl)-2-[4-(2,6-dioxo-1,3-dipropyl-2,3,6,7-tetrahydro-1H-purin-8-yl)-phenoxy]-acetamide (xanthine amine congenere, XAC) N-(2-Amino-ethyl)-2-[4-(2,6-dioxo-1,3-dipropyl-2,3,6,9-tetrahydro-1H-purin-8-yl)-phenoxy]-acetamide XAC
TypeSmall organic molecule
Emp. Form.C21H28N6O4
Mol. Mass.428.4848
SMILESCCCn1c2nc([nH]c2c(=O)n(CCC)c1=O)-c1ccc(OCC(=O)NCCN)cc1