Reaction Details
TargetAdenosine receptor A1
LigandBDBM50120447
Substrate/Competitorn/a
Meas. Tech.ChEMBL_29113 (CHEMBL638725)
Ki 7.9±n/a nM
Citation Bondavalli, FBotta, MBruno, OCiacci, ACorelli, FFossa, PLucacchini, AManetti, FMartini, CMenozzi, GMosti, LRanise, ASchenone, STafi, ATrincavellic, ML Synthesis, molecular modeling studies, and pharmacological activity of selective A(1) receptor antagonists. J Med Chem45:4875-87 (2002) Adenosine receptor A1
Name:Adenosine receptor A1
Type:Enzyme Catalytic Domain
Mol. Mass.:36602.99
Organism:BOVINE
Description:ADENOSINE 0 BOVINE::P28190
Residue:326
BDBM50120447
NameBDBM50120447
Synonyms:CHEMBL145058 | Cyclopentyl-(1-methyl-imidazo[1,2-a]quinoxalin-4-yl)-amine
TypeSmall organic molecule
Emp. Form.C16H18N4
Mol. Mass.266.3409
SMILESCc1cnc2c(NC3CCCC3)nc3ccccc3n12