Reaction Details
TargetAdenosine receptor A1
LigandBDBM50120451
Substrate/Competitorn/a
Meas. Tech.ChEMBL_29113 (CHEMBL638725)
Ki 540±n/a nM
Citation Bondavalli, FBotta, MBruno, OCiacci, ACorelli, FFossa, PLucacchini, AManetti, FMartini, CMenozzi, GMosti, LRanise, ASchenone, STafi, ATrincavellic, ML Synthesis, molecular modeling studies, and pharmacological activity of selective A(1) receptor antagonists. J Med Chem45:4875-87 (2002) Adenosine receptor A1
Name:Adenosine receptor A1
Type:Enzyme Catalytic Domain
Mol. Mass.:36602.99
Organism:BOVINE
Description:ADENOSINE 0 BOVINE::P28190
Residue:326
BDBM50120451
NameBDBM50120451
Synonyms:CHEMBL144032 | Cyclopentyl-(9-methyl-5,9-dihydro-4H-purin-6-yl)-amine
TypeSmall organic molecule
Emp. Form.C11H17N5
Mol. Mass.219.2862
SMILESCN1CNc2c1ncnc2NC1CCCC1