Reaction Details
TargetAdenosine receptor A1
LigandBDBM50008387
Substrate/Competitorn/a
Meas. Tech.ChEMBL_29113 (CHEMBL638725)
Ki 10±n/a nM
Citation Bondavalli, FBotta, MBruno, OCiacci, ACorelli, FFossa, PLucacchini, AManetti, FMartini, CMenozzi, GMosti, LRanise, ASchenone, STafi, ATrincavellic, ML Synthesis, molecular modeling studies, and pharmacological activity of selective A(1) receptor antagonists. J Med Chem45:4875-87 (2002) Adenosine receptor A1
Name:Adenosine receptor A1
Type:Enzyme Catalytic Domain
Mol. Mass.:36602.99
Organism:BOVINE
Description:ADENOSINE 0 BOVINE::P28190
Residue:326
BDBM50008387
NameBDBM50008387
Synonyms:CHEMBL19768 Cyclopentyl-(2-phenyl-1H-imidazo[4,5-c]quinolin-4-yl)-amine;HCl
TypeSmall organic molecule
Emp. Form.C21H20N4
Mol. Mass.328.4103
SMILESC1CCC(C1)Nc1nc2ccccc2c2nc([nH]c12)-c1ccccc1