Reaction Details
TargetSigma non-opioid intracellular receptor 1
LigandBDBM81982
Substrate/Competitorn/a
Meas. Tech.ChEMBL_201584 (CHEMBL809861)
Ki 63.9±n/a nM
Citation Maier, CAWünsch, B Novel sigma receptor ligands. Part 2. SAR of spiro[[2]benzopyran-1,4'-piperidines] and spiro[[2]benzofuran-1,4'-piperidines] with carbon substituents in position 3. J Med Chem45:4923-30 (2002) Sigma non-opioid intracellular receptor 1
Name:Sigma non-opioid intracellular receptor 1
Type:Enzyme Catalytic Domain
Mol. Mass.:25266.54
Organism:RAT
Description:Q9R0C9
Residue:223
BDBM81982
NameBDBM81982
Synonyms:CAS_97-39-2 DTG Tol2Gdn | cid_7333
TypeSmall organic molecule
Emp. Form.C15H17N3
Mol. Mass.239.3156
SMILESCc1ccccc1NC(N)=Nc1ccccc1C