Reaction Details
TargetNociceptin receptor
LigandBDBM50121245
Substrate/Competitorn/a
Meas. Tech.ChEMBL_146117 (CHEMBL754586)
Ki 0.05±n/a nM
Citation Zhang, CMiller, WValenzano, KJKyle, DJ Novel, potent ORL-1 receptor agonist peptides containing alpha-Helix-promoting conformational constraints. J Med Chem45:5280-6 (2002) Nociceptin receptor
Name:Nociceptin receptor
Type:G Protein-Coupled Receptor (GPCR)
Mol. Mass.:40702.87
Organism:Homo sapiens (Human)
Description:P41146
Residue:370
BDBM50121245
NameBDBM50121245
Synonyms:CHEMBL266191 | F-G-G-F-T-G-Aib-R-K-S-Aib-R-K-L-A-N-Q-CONH2
TypeSmall organic molecule
Emp. Form.C81H134N28O21
Mol. Mass.1836.1057
SMILESCC[C@H](NC(=O)CNC(=O)[C@@H](NC(=O)[C@H](Cc1ccccc1)NC(=O)CNC(=O)CNC(=O)[C@@H](N)Cc1ccccc1)[C@@H](C)O)C(=O)N[C@@H](CCCNC(N)=N)C(=O)N[C@@H](CCCCN)C(=O)N[C@@H](CO)C(=O)N[C@@H](CC)C(=O)N[C@@H](CCCNC(N)=N)C(=O)N[C@@H](CCCCN)C(=O)N[C@@H](CC(C)C)C(=O)N[C@@H](C)C(=O)N[C@@H](CC(N)=O)C(=O)N[C@@H](CCC(N)=O)C(N)=O