Reaction Details
TargetNociceptin receptor
LigandBDBM50121244
Substrate/Competitorn/a
Meas. Tech.ChEMBL_146106 (CHEMBL754508)
EC50 0.27±n/a nM
Citation Zhang, CMiller, WValenzano, KJKyle, DJ Novel, potent ORL-1 receptor agonist peptides containing alpha-Helix-promoting conformational constraints. J Med Chem45:5280-6 (2002) Nociceptin receptor
Name:Nociceptin receptor
Type:G Protein-Coupled Receptor (GPCR)
Mol. Mass.:40702.87
Organism:Homo sapiens (Human)
Description:P41146
Residue:370
BDBM50121244
NameBDBM50121244
Synonyms:CHEMBL264084 | F-G-G-F-T-G-Aib-R-K-S-A-R-K-L-A-N-Q-COOH
TypeSmall organic molecule
Emp. Form.C80H131N27O22
Mol. Mass.1823.0638
SMILESCC[C@H](NC(=O)CNC(=O)[C@@H](NC(=O)[C@H](Cc1ccccc1)NC(=O)CNC(=O)CNC(=O)[C@@H](N)Cc1ccccc1)[C@@H](C)O)C(=O)N[C@@H](CCCNC(N)=N)C(=O)N[C@@H](CCCCN)C(=O)N[C@@H](CO)C(=O)N[C@@H](C)C(=O)N[C@@H](CCCNC(N)=N)C(=O)N[C@@H](CCCCN)C(=O)N[C@@H](CC(C)C)C(=O)N[C@@H](C)C(=O)N[C@@H](CC(N)=O)C(=O)N[C@@H](CCC(N)=O)C(O)=O