Reaction Details
TargetNociceptin receptor
LigandBDBM50121253
Substrate/Competitorn/a
Meas. Tech.ChEMBL_146117 (CHEMBL754586)
Ki 0.08±n/a nM
Citation Zhang, CMiller, WValenzano, KJKyle, DJ Novel, potent ORL-1 receptor agonist peptides containing alpha-Helix-promoting conformational constraints. J Med Chem45:5280-6 (2002) Nociceptin receptor
Name:Nociceptin receptor
Type:G Protein-Coupled Receptor (GPCR)
Mol. Mass.:40702.87
Organism:Homo sapiens (Human)
Description:P41146
Residue:370
BDBM50121253
NameBDBM50121253
Synonyms:CHEMBL408356 | F-G-G-F-T-G-A-R-K-S-Aib-R-K-L-A-N-Q-CONH2
TypeSmall organic molecule
Emp. Form.C80H132N28O21
Mol. Mass.1822.0791
SMILESCC[C@H](NC(=O)[C@H](CO)NC(=O)[C@H](CCCCN)NC(=O)[C@H](CCCNC(N)=N)NC(=O)[C@H](C)NC(=O)CNC(=O)[C@@H](NC(=O)[C@H](Cc1ccccc1)NC(=O)CNC(=O)CNC(=O)[C@@H](N)Cc1ccccc1)[C@@H](C)O)C(=O)N[C@@H](CCCNC(N)=N)C(=O)N[C@@H](CCCCN)C(=O)N[C@@H](CC(C)C)C(=O)N[C@@H](C)C(=O)N[C@@H](CC(N)=O)C(=O)N[C@@H](CCC(N)=O)C(N)=O