Reaction Details
TargetMelanocortin receptor 5
LigandBDBM50121260
Substrate/Competitorn/a
Meas. Tech.ChEMBL_106527 (CHEMBL872337)
IC50 1.2±n/a nM
Citation Grieco, PLavecchia, ACai, MTrivedi, DWeinberg, DMacNeil, TVan der Ploeg, LHHruby, VJ Structure-activity studies of the melanocortin peptides: discovery of potent and selective affinity antagonists for the hMC3 and hMC4 receptors. J Med Chem45:5287-94 (2002) Melanocortin receptor 5
Name:Melanocortin receptor 5
Type:Enzyme
Mol. Mass.:36612.92
Organism:Homo sapiens (Human)
Description:P33032
Residue:325
BDBM50121260
NameBDBM50121260
Synonyms:3-(2-Acetylamino-hexanoylamino)-17-[3-(diaminomethaniminium)-propyl]-14-(1H-indol-3-ylmethyl)-20-naphthalen-2-ylmethyl-2,5,13,16,19,22-hexaoxo-1,6,12,15,18,21-hexaaza-tricyclo[21.8.0.0*25,30*]hentriaconta-25(30),26,28-triene-11-carboxylic acid amide CID44366183
TypeSmall organic molecule
Emp. Form.C58H73N13O9
Mol. Mass.1096.2819
SMILES[H][C@@]12Cc3ccccc3CN1C(=O)[C@@H](CC(=O)NCCCC[C@H](NC(=O)[C@H](Cc1c[nH]c3ccccc13)NC(=O)[C@@H](CCCNC(N)=N)NC(=O)[C@H](Cc1ccc3ccccc3c1)NC2=O)C(N)=O)NC(=O)[C@@H](CCCC)NC(C)=O