Reaction Details
TargetKappa-type opioid receptor
LigandBDBM50094634
Substrate/Competitorn/a
Meas. Tech.ChEMBL_147244 (CHEMBL755512)
Ki 1057±n/a nM
Citation Halab, LBecker, JADarula, ZTourwé, DKieffer, BLSimonin, FLubell, WD Probing opioid receptor interactions with azacycloalkane amino acids. Synthesis of a potent and selective ORL1 antagonist. J Med Chem45:5353-7 (2002) Kappa-type opioid receptor
Name:Kappa-type opioid receptor
Type:G Protein-Coupled Receptor (GPCR)
Mol. Mass.:42648.76
Organism:Homo sapiens (Human)
Description:P41145
Residue:380
BDBM50094634
NameBDBM50094634
Synonyms:CHEMBL140979 N-(4-amino-2-methylquinolin-6-yl)-2-((4-ethylphenoxy)methyl)benzamide
TypeSmall organic molecule
Emp. Form.C26H25N3O2
Mol. Mass.411.4956
SMILESCCc1ccc(OCc2ccccc2C(=O)Nc2ccc3nc(C)cc(N)c3c2)cc1