Reaction Details
TargetDelta-type opioid receptor
LigandBDBM50218796
Substrate/Competitorn/a
Meas. Tech.ChEMBL_147184 (CHEMBL754483)
Ki 2±n/a nM
Citation Schütz, JDersch, CMHorel, RSpetea, MKoch, MMeditz, RGreiner, ERothman, RBSchmidhammer, H Synthesis and biological evaluation of 14-alkoxymorphinans. 17. Highly delta opioid receptor selective 14-alkoxy-substituted indolo- and benzofuromorphinans. J Med Chem45:5378-83 (2002) Delta-type opioid receptor
Name:Delta-type opioid receptor
Type:G Protein-Coupled Receptor (GPCR)
Mol. Mass.:40465.04
Organism:Rattus norvegicus (rat)
Description:Competition binding assays were using CHO-K1 cell membranes expressing the opioid receptor.
Residue:372
BDBM50218796
NameBDBM50218796
Synonyms:CHEMBL557978 oxymorphindole
TypeSmall organic molecule
Emp. Form.C23H22N2O3
Mol. Mass.374.4324
SMILESCN1CC[C@@]23[C@H]4Oc5c2c(C[C@@H]1[C@]3(O)Cc1c4[nH]c2ccccc12)ccc5O