Reaction Details
TargetGag-Pol polyprotein [489-587]
LigandBDBM855
Substrate/Competitorn/a
Meas. Tech.ChEMBL_158026 (CHEMBL768619)
Ki 0.3±n/a nM
Kd 18±n/a nM
KON 29300 M-1s-1
Citation Markgren, POSchaal, WHämäläinen, MKarlén, AHallberg, ASamuelsson, BDanielson, UH Relationships between structure and interaction kinetics for HIV-1 protease inhibitors. J Med Chem45:5430-9 (2002) Gag-Pol polyprotein [489-587]
Name:Gag-Pol polyprotein [489-587]
Type:Enzyme Subunit
Mol. Mass.:10781.16
Organism:Human immunodeficiency virus type 1
Description:P04585[489-587]
Residue:99
BDBM855
NameBDBM855
Synonyms:(2R,3R,4R,5R)-3,4-dihydroxy-2,5-bis({[4-(2-hydroxy-3-oxocyclohex-1-en-1-yl)phenyl]methoxy})-N,N'-bis[(1S)-2-methyl-1-(methylcarbamoyl)propyl]hexanediamide CHEMBL338428 | N1,N6-Bis[(1S)-2-methyl-1-(methylcarbamoyl)pro-pyl](2R,3R,4R,5R)-2,5-bis[4-(3-cyclohexane-1,2-dionyl)benzyloxy]-3,4-dihydroxyhexanediamide
TypeSmall organic molecule
Emp. Form.C44H58N4O12
Mol. Mass.834.9509
SMILESCNC(=O)[C@@H](NC(=O)[C@H](OCc1ccc(cc1)C1CCCC(=O)C1=O)[C@H](O)[C@@H](O)[C@@H](OCc1ccc(cc1)C1CCCC(=O)C1=O)C(=O)N[C@@H](C(C)C)C(=O)NC)C(C)C