Reaction Details
TargetGag-Pol polyprotein [489-587]
LigandBDBM344
Substrate/Competitorn/a
Meas. Tech.ChEMBL_158026 (CHEMBL768619)
Ki 43±n/a nM
Kd 1140±n/a nM
KON 200000 M-1s-1
Citation Markgren, POSchaal, WHämäläinen, MKarlén, AHallberg, ASamuelsson, BDanielson, UH Relationships between structure and interaction kinetics for HIV-1 protease inhibitors. J Med Chem45:5430-9 (2002) Gag-Pol polyprotein [489-587]
Name:Gag-Pol polyprotein [489-587]
Type:Enzyme Subunit
Mol. Mass.:10781.16
Organism:Human immunodeficiency virus type 1
Description:P04585[489-587]
Residue:99
BDBM344
NameBDBM344
Synonyms:(3R,4S,5S,6R)-4,5-dihydroxy-2,7-bis({[3-(2-hydroxyethyl)phenyl]methyl})-3,6-bis(phenoxymethyl)-1,2,7-thiadiazepane-1,1-dione Cyclic Sulfamide deriv. 22
TypeSmall organic molecule
Emp. Form.C36H42N2O8S
Mol. Mass.662.792
SMILESOCCc1cccc(CN2[C@H](COc3ccccc3)[C@H](O)[C@@H](O)[C@@H](COc3ccccc3)N(Cc3cccc(CCO)c3)S2(=O)=O)c1