Reaction Details
TargetGag-Pol polyprotein [489-587]
LigandBDBM50121522
Substrate/Competitorn/a
Meas. Tech.ChEMBL_158026 (CHEMBL768619)
Ki 40±n/a nM
Kd 2.99±n/a nM
KON 9200 M-1s-1
Citation Markgren, POSchaal, WHämäläinen, MKarlén, AHallberg, ASamuelsson, BDanielson, UH Relationships between structure and interaction kinetics for HIV-1 protease inhibitors. J Med Chem45:5430-9 (2002) Gag-Pol polyprotein [489-587]
Name:Gag-Pol polyprotein [489-587]
Type:Enzyme Subunit
Mol. Mass.:10781.16
Organism:Human immunodeficiency virus type 1
Description:P04585[489-587]
Residue:99
BDBM50121522
NameBDBM50121522
Synonyms:2-({2,5-Bis-benzyloxy-5-[(1-carboxy-2-methyl-propyl)-methyl-carbamoyl]-3,4-dihydroxy-pentanoyl}-methyl-amino)-3-methyl-butyric acid | CHEMBL149528
TypeSmall organic molecule
Emp. Form.C32H44N2O10
Mol. Mass.616.6992
SMILESCC(C)C(N(C)C(=O)[C@H](OCc1ccccc1)[C@@H](O)[C@H](O)[C@@H](OCc1ccccc1)C(=O)N(C)C(C(C)C)C(O)=O)C(O)=O