Reaction Details
TargetGag-Pol polyprotein [489-587]
LigandBDBM342
Substrate/Competitorn/a
Meas. Tech.ChEMBL_158026 (CHEMBL768619)
Ki 5.6±n/a nM
Kd 169±n/a nM
KON 512000 M-1s-1
Citation Markgren, POSchaal, WHämäläinen, MKarlén, AHallberg, ASamuelsson, BDanielson, UH Relationships between structure and interaction kinetics for HIV-1 protease inhibitors. J Med Chem45:5430-9 (2002) Gag-Pol polyprotein [489-587]
Name:Gag-Pol polyprotein [489-587]
Type:Enzyme Subunit
Mol. Mass.:10781.16
Organism:Human immunodeficiency virus type 1
Description:P04585[489-587]
Residue:99
BDBM342
NameBDBM342
Synonyms:(3R,4S,5S,6R)-4,5-dihydroxy-2,7-bis({3-[(1E)-1-(hydroxyimino)ethyl]phenyl}methyl)-3,6-bis(phenoxymethyl)-1,2,7-thiadiazepane-1,1-dione Cyclic Sulfamide deriv. 20
TypeSmall organic molecule
Emp. Form.C36H40N4O8S
Mol. Mass.688.79
SMILESCC(N=O)c1cccc(CN2[C@H](COc3ccccc3)[C@H](O)[C@@H](O)[C@@H](COc3ccccc3)N(Cc3cccc(c3)C(C)N=O)S2(=O)=O)c1